Target
Prothrombin
Ligand
BDBM33818
Substrate
Boc-Val-Pro-Arg-AMC
Meas. Tech.
Thrombin 1536 HTS Dose Response Confirmation
pH
7.5±n/a
Temperature
296.15±n/a K
IC50
>50000±n/a nM
Citation
 PubChem, PC Thrombin 1536 HTS Dose Response Confirmation PubChem Bioassay (2008)[AID] 
Target
Name:
Prothrombin
Synonyms:
Activation peptide fragment 1 Coagulation factor II Prothrombin precursor Thrombin heavy chain | Thrombin light chain
Type:
Protein
Mol. Mass.:
70029.57
Organism:
Homo sapiens (Human)
Description:
P00734
Residue:
622
  
Inhibitor
Name:
BDBM33818
Synonyms:
3-Amino-6-phenyl-4-trifluoromethyl-thieno[2,3-b]pyridine-2-carbonitrile 3-amino-6-phenyl-4-(trifluoromethyl)thieno[2,3-b]pyridine-2-carbonitrile MLS000590258 cid_712450
Type:
Small organic molecule
Emp. Form.:
C15H8F3N3S
Mol. Mass.:
319.304
SMILES:
Nc1c(sc2nc(cc(c12)C(F)(F)F)-c1ccccc1)C#N
:
Substrate
Name:
Boc-Val-Pro-Arg-AMC
Synonyms:
Type:
fluorogenic substrate
Mol. Mass.:
358.43
Organism:
Description:
Residue:
3
NA