Target
Gag-Pol polyprotein [600-1029,C879S]/[600-1159,C879S]
Ligand
BDBM33963
Substrate
RNA/DNA hybrid
Meas. Tech.
FRET-Based RNase H Assay
pH
8±n/a
Temperature
293.15±n/a K
IC50
3200±n/a nM
Citation
 Wendeler, MLee, HFBermingham, AMiller, JTChertov, OBona, MKBaichoo, NSEhteshami, MBeutler, JO'Keefe, BRGötte, MKvaratskhelia, MLe Grice, S Vinylogous ureas as a novel class of inhibitors of reverse transcriptase-associated ribonuclease H activity. ACS Chem Biol 3:635-44 (2008)  
Target
Name:
Gag-Pol polyprotein [600-1029,C879S]/[600-1159,C879S]
Synonyms:
HIV-1 Reverse Transcriptase
Type:
Protein Complex
Mol. Mass.:
Description:
Wild-type p66/p51 HIV-1 RT, derived from BH-10 clone of HIV-1, was expressed in bacteria.
Components:
This complex has 2 components.
Component 1
Name:
Gag-Pol polyprotein [600-1159,C879S]
Synonyms:
HIV-1 Reverse Transcriptase Chain A gag-pol
Type:
Enzyme Subunit
Mol. Mass.:
64425.43
Organism:
Human immunodeficiency virus type 1
Description:
P03366[600-1159,C879S]
Residue:
560
  
Component 2
Name:
Gag-Pol polyprotein [600-1029,C879S]
Synonyms:
HIV-1 Reverse Transcriptase Chain B gag-pol
Type:
Enzyme Subunit
Mol. Mass.:
50221.85
Organism:
Human immunodeficiency virus type 1
Description:
P03366[600-1029,C879S]
Residue:
430
  
Inhibitor
Name:
BDBM33963
Synonyms:
vinylogous urea, NSC727448
Type:
Small organic molecule
Emp. Form.:
C12H12N2O3S
Mol. Mass.:
264.3
SMILES:
Cc1sc(NC(=O)c2ccco2)c(C(N)=O)c1C
:
Substrate
Name:
RNA/DNA hybrid
Synonyms:
Type:
fluorescein-labeled RNA annealed to DNA
Mol. Mass.:
2134.40
Organism:
Description:
It is a 18-nucleotide 3-fluorescein-labeled RNA annealed to a complementary 18-nucleotide 5-Dabcyl-modified DNA.
Residue:
23