Target
Ribonuclease HI
Ligand
BDBM33045
Substrate
RNA/DNA hybrid
Meas. Tech.
FRET-Based RNase H Assay
pH
8±n/a
Temperature
293.15±n/a K
IC50
100000±n/a nM
Citation
 Wendeler, MLee, HFBermingham, AMiller, JTChertov, OBona, MKBaichoo, NSEhteshami, MBeutler, JO'Keefe, BRGötte, MKvaratskhelia, MLe Grice, S Vinylogous ureas as a novel class of inhibitors of reverse transcriptase-associated ribonuclease H activity. ACS Chem Biol 3:635-44 (2008)  
Target
Name:
Ribonuclease HI
Synonyms:
RNH_ECOLI Ribonuclease H dasF rnh sdrA
Type:
Enzyme
Mol. Mass.:
17601.33
Organism:
Escherichia coli (strain K12)
Description:
Residue:
155
  
Inhibitor
Name:
BDBM33045
Synonyms:
2-amino-5,6,7,8-tetrahydro-4H-cyclohepta[b]thiophene-3-carboxamide MLS000056922 cid_2997881 | vinylogous urea, NSC727447
Type:
Small organic molecule
Emp. Form.:
C10H14N2OS
Mol. Mass.:
210.296
SMILES:
NC(=O)c1c(N)sc2CCCCCc12
:
Substrate
Name:
RNA/DNA hybrid
Synonyms:
Type:
fluorescein-labeled RNA annealed to DNA
Mol. Mass.:
2134.40
Organism:
Description:
It is a 18-nucleotide 3-fluorescein-labeled RNA annealed to a complementary 18-nucleotide 5-Dabcyl-modified DNA.
Residue:
23