Target
Ribonuclease HI
Ligand
BDBM33963
Substrate
RNA/DNA hybrid
Meas. Tech.
FRET-Based RNase H Assay
pH
8±n/a
Temperature
293.15±n/a K
IC50
73000±n/a nM
Citation
 Wendeler, MLee, HFBermingham, AMiller, JTChertov, OBona, MKBaichoo, NSEhteshami, MBeutler, JO'Keefe, BRGötte, MKvaratskhelia, MLe Grice, S Vinylogous ureas as a novel class of inhibitors of reverse transcriptase-associated ribonuclease H activity. ACS Chem Biol 3:635-44 (2008)  
Target
Name:
Ribonuclease HI
Synonyms:
RNH_ECOLI Ribonuclease H dasF rnh sdrA
Type:
Enzyme
Mol. Mass.:
17601.33
Organism:
Escherichia coli (strain K12)
Description:
Residue:
155
  
Inhibitor
Name:
BDBM33963
Synonyms:
vinylogous urea, NSC727448
Type:
Small organic molecule
Emp. Form.:
C12H12N2O3S
Mol. Mass.:
264.3
SMILES:
Cc1sc(NC(=O)c2ccco2)c(C(N)=O)c1C
:
Substrate
Name:
RNA/DNA hybrid
Synonyms:
Type:
fluorescein-labeled RNA annealed to DNA
Mol. Mass.:
2134.40
Organism:
Description:
It is a 18-nucleotide 3-fluorescein-labeled RNA annealed to a complementary 18-nucleotide 5-Dabcyl-modified DNA.
Residue:
23