Target
Gag-Pol polyprotein
Ligand
BDBM34293
Substrate
RNA/DNA hybrid
Meas. Tech.
HIV-1 RT-RNase H MLSCN MH077605 Probe Assessment: Dose response Assay
pH
8±n/a
Temperature
296.15±n/a K
IC50
2078.000069±n/a nM
Citation
 PubChem, PC HIV-1 RT-RNase H MLSCN MH077605 Probe Assessment: Dose response Assay PubChem Bioassay (2007)[AID] 
Target
Name:
Gag-Pol polyprotein
Synonyms:
HIV-1 reverse transcriptase (HIV-1 RT) POL_HV1H2 Protease Reverse transcriptase (RT) gag-pol p66 RT
Type:
Protein
Mol. Mass.:
162074.74
Organism:
Human immunodeficiency virus type 1 group M subtype B (isolate HXB2)
Description:
P04585
Residue:
1435
  
Inhibitor
Name:
BDBM34293
Synonyms:
3-(1-benzotriazolylmethyl)-6-[(4-fluorophenoxy)methyl]-[1,2,4]triazolo[3,4-b][1,3,4]thiadiazole 3-(benzotriazol-1-ylmethyl)-6-[(4-fluorophenoxy)methyl]-[1,2,4]triazolo[3,4-b][1,3,4]thiadiazole SMR000047317 | cid_666068
Type:
Small organic molecule
Emp. Form.:
C17H12FN7OS
Mol. Mass.:
381.387
SMILES:
Fc1ccc(OCc2nn3c(Cn4nnc5ccccc45)nnc3s2)cc1
:
Substrate
Name:
RNA/DNA hybrid
Synonyms:
Type:
fluorescein-labeled RNA annealed to DNA
Mol. Mass.:
358.43
Organism:
Description:
It is a 18-nucleotide 3-fluorescein-labeled RNA annealed to a complementary 18-nucleotide 5-Dabcyl-modified DNA.
Residue:
3
NA