Target
Mannose-6-phosphate isomerase
Ligand
BDBM34334
Substrate
Mannose-6-phosphate
Meas. Tech.
HTS identification of compounds inhibiting phosphomannose isomerase (PMI) via a fluorescence intensity assay using a high concentration of mannose 6-phosphate
pH
7.4±n/a
Temperature
296.15±n/a K
IC50
1498.7±0 nM
Citation
 PubChem, PC HTS identification of compounds inhibiting phosphomannose isomerase (PMI) via a fluorescence intensity assay using a high concentration of mannose 6-phosphate PubChem Bioassay (2009)[AID] 
Target
Name:
Mannose-6-phosphate isomerase
Synonyms:
MPI MPI_HUMAN PMI1
Type:
PROTEIN
Mol. Mass.:
46651.35
Organism:
Homo sapiens (Human)
Description:
ChEMBL_1448919
Residue:
423
  
Inhibitor
Name:
BDBM34334
Synonyms:
MLS000055225 N-[1,3-benzothiazol-2-yl(phenyl)phosphoryl]-2-thiazolamine [1,3-benzothiazol-2-yl(phenyl)phosphoryl]-thiazol-2-yl-amine | cid_2311082
Type:
Small organic molecule
Emp. Form.:
C16H12N3OPS2
Mol. Mass.:
357.39
SMILES:
O=P(Nc1nccs1)(c1nc2ccccc2s1)c1ccccc1
:
Substrate
Name:
Mannose-6-phosphate
Synonyms:
Type:
Mol. Mass.:
358.43
Organism:
Description:
Residue:
3
NA