Target
Mannose-6-phosphate isomerase
Ligand
BDBM34657
Substrate
Mannose-6-phosphate
Meas. Tech.
HTS identification of compounds inhibiting phosphomannose isomerase (PMI) via a fluorescence intensity assay using a high concentration of mannose 6-phosphate
pH
7.4±n/a
Temperature
296.15±n/a K
IC50
2707.5±0 nM
Citation
 PubChem, PC HTS identification of compounds inhibiting phosphomannose isomerase (PMI) via a fluorescence intensity assay using a high concentration of mannose 6-phosphate PubChem Bioassay (2009)[AID] 
Target
Name:
Mannose-6-phosphate isomerase
Synonyms:
MPI MPI_HUMAN PMI1
Type:
PROTEIN
Mol. Mass.:
46651.35
Organism:
Homo sapiens (Human)
Description:
ChEMBL_1448919
Residue:
423
  
Inhibitor
Name:
BDBM34657
Synonyms:
MLS000121202 [(3-methyl-4-oxidanylidene-cyclohexa-2,5-dien-1-ylidene)amino] benzenesulfonate benzenesulfonic acid [(3-methyl-4-oxo-1-cyclohexa-2,5-dienylidene)amino] ester cid_2246289
Type:
Small organic molecule
Emp. Form.:
C13H11NO4S
Mol. Mass.:
277.296
SMILES:
CC1=CC(C=CC1=O)=NOS(=O)(=O)c1ccccc1
:
Substrate
Name:
Mannose-6-phosphate
Synonyms:
Type:
Mol. Mass.:
358.43
Organism:
Description:
Residue:
3
NA