Target
Oxysterols receptor LXR-alpha [197-447]
Ligand
BDBM20000
Substrate
BDBM19993
Meas. Tech.
LXRbeta Binding Assay (IC50) and LAFbeta Functional Assay (EC50)
IC50
9.5±n/a nM
Citation
 Bernotas, RCKaufman, DHSinghaus, RRUllrich, JUnwalla, RQuinet, ENambi, PWilhelmsson, AGoos-Nilsson, AWrobel, J 4-(3-aryloxyaryl)quinoline alcohols are liver X receptor agonists. Bioorg Med Chem 17:8086-92 (2009)  
Target
Name:
Oxysterols receptor LXR-alpha [197-447]
Synonyms:
LXRA NR1H3 Nuclear orphan receptor LXR-alpha Oxysterols receptor LXR-alpha
Type:
Receptor
Mol. Mass.:
28986.41
Organism:
Homo sapiens (Human)
Description:
LXR alpha ligand binding domain (amino acid residues 197-447) with an N-terminal biotinylation tag expressed in E.coli, was used for the binding assays.
Residue:
251
  
Inhibitor
Name:
BDBM20000
Synonyms:
2-(4-{3-[3-benzyl-8-(trifluoromethyl)quinolin-4-yl]phenoxymethyl}phenyl)acetic acid JMC496151 Compound 15 | WAY-254011
Type:
Small organic molecule
Emp. Form.:
C32H24F3NO3
Mol. Mass.:
527.5331
SMILES:
OC(=O)Cc1ccc(COc2cccc(c2)-c2c(Cc3ccccc3)cnc3c(cccc23)C(F)(F)F)cc1
:
Substrate
Name:
BDBM19993
Synonyms:
CHEMBL62136 T 0901317 TO-901317 US10669296, Compound TO901317 [3H]T0901317
Type:
Small organic molecule
Emp. Form.:
C17H12F9NO3S
Mol. Mass.:
481.333
SMILES:
OC(c1ccc(cc1)N(CC(F)(F)F)S(=O)(=O)c1ccccc1)(C(F)(F)F)C(F)(F)F
: