Target
Oxysterols receptor LXR-beta [154-461]
Ligand
BDBM35108
Substrate
BDBM19993
Meas. Tech.
LXR Binding Assay and hLXR Reporter Assay
pH
7.4±n/a
Temperature
277.15±n/a K
IC50
9±n/a nM
EC50
800±n/a nM
Comments
Efficacy=66%.
Citation
 Bernotas, RCSinghaus, RRKaufman, DHUllrich, JFletcher, HQuinet, ENambi, PUnwalla, RWilhelmsson, AGoos-Nilsson, AFarnegardh, MWrobel, J Biarylether amide quinolines as liver X receptor agonists. Bioorg Med Chem 17:1663-70 (2009)  
Target
Name:
Oxysterols receptor LXR-beta [154-461]
Synonyms:
LXRB NER NR1H2_HUMAN Nuclear receptor NER Oxysterols receptor LXR-beta Ubiquitously-expressed nuclear receptor
Type:
Receptor
Mol. Mass.:
34695.52
Organism:
Homo sapiens (Human)
Description:
LXR beta ligand binding domain (amino acid residues 154-461) with an N-terminal biotinylation tag expressed in E.coli, was used for the binding assays.
Residue:
308
  
Inhibitor
Name:
BDBM35108
Synonyms:
biarylether amide quinoline, 4i
Type:
Small organic molecule
Emp. Form.:
C24H19ClN2O2
Mol. Mass.:
402.873
SMILES:
CNC(=O)c1cccc(Oc2cccc(c2)-c2c(C)cnc3c(Cl)cccc23)c1
:
Substrate
Name:
BDBM19993
Synonyms:
CHEMBL62136 T 0901317 TO-901317 US10669296, Compound TO901317 [3H]T0901317
Type:
Small organic molecule
Emp. Form.:
C17H12F9NO3S
Mol. Mass.:
481.333
SMILES:
OC(c1ccc(cc1)N(CC(F)(F)F)S(=O)(=O)c1ccccc1)(C(F)(F)F)C(F)(F)F
: