Target
Oxysterols receptor LXR-alpha [197-447]
Ligand
BDBM35087
Substrate
BDBM19993
Meas. Tech.
LXR Binding Assay and hLXR Reporter Assay
IC50
231±n/a nM
Citation
 Bernotas, RCSinghaus, RRKaufman, DHUllrich, JFletcher, HQuinet, ENambi, PUnwalla, RWilhelmsson, AGoos-Nilsson, AFarnegardh, MWrobel, J Biarylether amide quinolines as liver X receptor agonists. Bioorg Med Chem 17:1663-70 (2009)  
Target
Name:
Oxysterols receptor LXR-alpha [197-447]
Synonyms:
LXRA NR1H3 Nuclear orphan receptor LXR-alpha Oxysterols receptor LXR-alpha
Type:
Receptor
Mol. Mass.:
28986.41
Organism:
Homo sapiens (Human)
Description:
LXR alpha ligand binding domain (amino acid residues 197-447) with an N-terminal biotinylation tag expressed in E.coli, was used for the binding assays.
Residue:
251
  
Inhibitor
Name:
BDBM35087
Synonyms:
BMC171663 Compound 4a | Benzylquinoline, 8a
Type:
Small organic molecule
Emp. Form.:
C31H22F3NO3
Mol. Mass.:
513.5065
SMILES:
COC(=O)c1cccc(Oc2cccc(c2)-c2c(Cc3ccccc3)cnc3c(cccc23)C(F)(F)F)c1
:
Substrate
Name:
BDBM19993
Synonyms:
CHEMBL62136 T 0901317 TO-901317 US10669296, Compound TO901317 [3H]T0901317
Type:
Small organic molecule
Emp. Form.:
C17H12F9NO3S
Mol. Mass.:
481.333
SMILES:
OC(c1ccc(cc1)N(CC(F)(F)F)S(=O)(=O)c1ccccc1)(C(F)(F)F)C(F)(F)F
: