Target
Leucyl-cystinyl aminopeptidase
Ligand
BDBM401355
Substrate
Meas. Tech.
Inhibition Assay
IC50
0.940±n/a nM
Citation
 Kawaguchi, KIshihata, AKanai, ATsuchiya, KInagaki, YKazami, JMorikawa, HHiramoto, MEnjo, KTakamatsu, H Pyridine derivatives US Patent  US10005762 Publication Date 6/26/2018 
Target
Name:
Leucyl-cystinyl aminopeptidase
Synonyms:
Cystinyl aminopeptidase Insulin-regulated membrane aminopeptidase Irap Leucyl-cystinyl aminopeptidase Otase P-LAP Vesicle protein of 165 kDa | Vp165
Type:
PROTEIN
Mol. Mass.:
117179.39
Organism:
Rattus norvegicus
Description:
ChEMBL_98523
Residue:
1025
  
Inhibitor
Name:
BDBM401355
Synonyms:
US10005762, Example 35
Type:
Small organic molecule
Emp. Form.:
C19H30N2O3S
Mol. Mass.:
366.518
SMILES:
CSC[C@H](N)[C@](O)(Cc1cc(CCCCC2CC2)c(C)cn1)C(O)=O
: