Target
Dimer of Gag-Pol polyprotein [489-587]
Ligand
BDBM867
Substrate
HIV Protease Peptide Substrate
Meas. Tech.
Protease Inhibition Assay
pH
6.25±n/a
Temperature
310.15±n/a K
Ki
16.1±n/a nM
Citation
 Ettmayer, PBillich, AHecht, PRosenwirth, BGstach, H Paracyclophanes: a novel class of water-soluble inhibitors of HIV proteinase. J Med Chem 39:3291-9 (1996)  
Target
Name:
Dimer of Gag-Pol polyprotein [489-587]
Synonyms:
HIV-1 Protease
Type:
Protein Complex
Mol. Mass.:
Description:
Components:
This complex has 2 components.
Component 1
Name:
Gag-Pol polyprotein [489-587]
Synonyms:
HIV protease HIV-1 Protease chain A POL_HV1N5 | gag-pol
Type:
Enzyme Subunit
Mol. Mass.:
10822.21
Organism:
Human immunodeficiency virus type 1
Description:
P12497[489-587]
Residue:
99
  
Component 2
Name:
Gag-Pol polyprotein [489-587]
Synonyms:
HIV protease HIV-1 Protease chain A POL_HV1N5 | gag-pol
Type:
Enzyme Subunit
Mol. Mass.:
10822.21
Organism:
Human immunodeficiency virus type 1
Description:
P12497[489-587]
Residue:
99
  
Inhibitor
Name:
BDBM867
Synonyms:
1OH-2(Cbz-Tle)3PhPr [14]paracyclophane deriv. 30 | tert-butyl N-[(1S,2S)-1-[(9R,12R)-8,11-dioxo-9-(propan-2-yl)-2-oxa-7,10,13-triazabicyclo[13.3.1]nonadeca-1(18),15(19),16-trien-12-yl]-1-hydroxy-3-phenylpropan-2-yl]carbamate
Type:
Small organic molecule
Emp. Form.:
C32H46N4O6
Mol. Mass.:
582.7308
SMILES:
CC(C)C1NC(=O)[C@H](NCc2cccc(OCCCCNC1=O)c2)C(O)[C@H](Cc1ccccc1)NC(=O)OC(C)(C)C
:
Substrate
Name:
HIV Protease Peptide Substrate
Synonyms:
Type:
Peptide
Mol. Mass.:
3062.94
Organism:
Synthesized
Description:
Residue:
29