Target
Coagulation factor X
Ligand
BDBM35762
Substrate
BDBM12658
Meas. Tech.
Enzyme Inhibition Assay
pH
7.4±n/a
Temperature
296.15±n/a K
IC50
3±n/a nM
Citation
 Yoshikawa, KKobayashi, SNakamoto, YHaginoya, NKomoriya, SYoshino, TNagata, TMochizuki, AWatanabe, KSuzuki, MKanno, HOhta, T Design, synthesis, and SAR of cis-1,2-diaminocyclohexane derivatives as potent factor Xa inhibitors. Part II: exploration of 6-6 fused rings as alternative S1 moieties. Bioorg Med Chem 17:8221-33 (2009)  
Target
Name:
Coagulation factor X
Synonyms:
Activated coagulation factor X (FXa) Coagulation factor X precursor F10 Factor X heavy chain Factor Xa Stuart-Prower factor
Type:
Enzyme
Mol. Mass.:
54726.60
Organism:
Homo sapiens (Human)
Description:
Residue:
488
  
Inhibitor
Name:
BDBM35762
Synonyms:
cis-1,2-diaminocyclohexane derivative, 5c
Type:
Small organic molecule
Emp. Form.:
C27H31ClN6O3S
Mol. Mass.:
555.091
SMILES:
CN(C)C(=O)[C@H]1CC[C@H](NC(=O)c2cc3ccc(Cl)cc3cn2)[C@@H](C1)NC(=O)c1nc2CCN(C)Cc2s1
:
Substrate
Name:
BDBM12658
Synonyms:
4-[({[(1S)-4-carbamimidamido-1-[(4-nitrophenyl)carbamoyl]butyl]carbamoyl}methyl)carbamoyl]-4-[(2S,3S)-3-methyl-2-(phenylformamido)pentanamido]butanoic acid hydrochloride Chromogenic Substrate S-2222 benzoyl-Ile-Glu-Gly-Arg-p-nitroanilide
Type:
Small organic molecule
Emp. Form.:
C32H43N9O9
Mol. Mass.:
697.7387
SMILES:
[#6]-[#6]-[#6@H](-[#6])-[#6@H](-[#7]-[#6](=O)-c1ccccc1)-[#6](=O)-[#7]-[#6@@H](-[#6]-[#6]-[#6](-[#8])=O)-[#6](=O)-[#7]-[#6]-[#6](=O)-[#7]-[#6@@H](-[#6]-[#6]-[#6]\[#7]=[#6](\[#7])-[#7])-[#6](=O)-[#7]-c1ccc(cc1)-[#7+](-[#8-])=O
: