Target
Malignant T-cell-amplified sequence 1
Ligand
BDBM403224
Substrate
Meas. Tech.
MTT assay
EC50
<20.0±n/a nM
Citation
 Bannister, TDRoush, WRChoi, JYNair, RTsai, ASMishra, JKCleveland, JL Heterocyclic inhibitors of monocarboxylate transporter US Patent  US10329303 Publication Date 6/25/2019 
Target
Name:
Malignant T-cell-amplified sequence 1
Synonyms:
MCT-1 MCTS1 Multiple copies T-cell malignancies
Type:
Enzyme Catalytic Domain
Mol. Mass.:
20563.62
Organism:
Homo sapiens (human)
Description:
Residue:
181
  
Inhibitor
Name:
BDBM403224
Synonyms:
US10329303, Example 23
Type:
Small organic molecule
Emp. Form.:
C25H29N5O3S
Mol. Mass.:
479.594
SMILES:
CC(C)Cn1c2sc(Cc3c(C)n[nH]c3C)c(-c3ccnc(CO)c3)c2c(=O)n(C2CC2)c1=O
: