Target
Malignant T-cell-amplified sequence 1
Ligand
BDBM403237
Substrate
Meas. Tech.
MTT assay
EC50
100.0±n/a nM
Citation
 Bannister, TDRoush, WRChoi, JYNair, RTsai, ASMishra, JKCleveland, JL Heterocyclic inhibitors of monocarboxylate transporter US Patent  US10329303 Publication Date 6/25/2019 
Target
Name:
Malignant T-cell-amplified sequence 1
Synonyms:
MCT-1 MCTS1 Multiple copies T-cell malignancies
Type:
Enzyme Catalytic Domain
Mol. Mass.:
20563.62
Organism:
Homo sapiens (human)
Description:
Residue:
181
  
Inhibitor
Name:
BDBM403237
Synonyms:
US10329303, Example 36
Type:
Small organic molecule
Emp. Form.:
C30H31N3O2
Mol. Mass.:
465.586
SMILES:
CC(C)Cc1nn(C)c(=O)c2c(-c3cccc(c3)C(C)O)n(Cc3cccc4ccccc34)cc12
: