Target
Carbonic anhydrase 2
Ligand
BDBM36008
Substrate
Meas. Tech.
SPR biosensor assay Biacore T100
pH
7.4±n/a
Temperature
298.15±n/a K
Kd
383±n/a nM
KOFF
51000 s-1
KON
0.01956 M-1s-1
Citation
 Navratilova, IHopkins, AL Fragment Screening by Surface Plasmon Resonance ACS Med Chem Lett 1:44-8 (2010)   
Target
Name:
Carbonic anhydrase 2
Synonyms:
CA2 Carbonic anhydrase Carbonic anhydrase II Carbonic anhydrase II (CA-II)
Type:
Enzyme Catalytic Domain
Mol. Mass.:
29115.93
Organism:
Bos taurus
Description:
Residue:
260
  
Inhibitor
Name:
BDBM36008
Synonyms:
2-amino-1,3-benzothiazole-6-sulfonamide | SPR_12
Type:
Small organic molecule
Emp. Form.:
C7H7N3O2S2
Mol. Mass.:
229.279
SMILES:
Nc1nc2ccc(cc2s1)S(N)(=O)=O
: