Target
Receptor protein serine/threonine kinase
Ligand
BDBM36354
Substrate
poly(Glu4, Tyr)
Meas. Tech.
Kinase assay toxicity
EC50
>5.0e+4±n/a nM
Citation
 Hao, JHo, JNLewis, JAKarim, KADaniels, RNGentry, PRHopkins, CRLindsley, CWHong, CC In vivo structure-activity relationship study of dorsomorphin analogues identifies selective VEGF and BMP inhibitors. ACS Chem Biol 5:245-53 (2010)  
Target
Name:
Receptor protein serine/threonine kinase
Synonyms:
B3DJG0 Bmpr1a protein | Bone morphogenetic protein
Type:
Mol. Mass.:
59502.00
Organism:
Danio rerio (Zebrafish)
Description:
B3DJG0
Residue:
526
  
Inhibitor
Name:
BDBM36354
Synonyms:
4-(6-(4-isopropoxyphenyl)pyrazolo[1,5-a]pyrimidin- 3-yl)quinoline US9040694, 1
Type:
Small organic molecule
Emp. Form.:
C24H20N4O
Mol. Mass.:
380.4418
SMILES:
CC(C)Oc1ccc(cc1)-c1cnc2c(cnn2c1)-c1ccnc2ccccc12
:
Substrate
Name:
poly(Glu4, Tyr)
Synonyms:
Type:
Random copolymer
Mol. Mass.:
358.43
Organism:
Description:
Residue:
3
NA