Target
Beta-mannosidase
Ligand
BDBM36389
Substrate
Meas. Tech.
Btman2A
pH
5.6±0
Temperature
310.15±0 K
Ki
11000000±0.0 nM
Citation
 Tailford, LEOffen, WASmith, NLDumon, CMorland, CGratien, JHeck, MPStick, RVBlériot, YVasella, AGilbert, HJDavies, GJ Structural and biochemical evidence for a boat-like transition state in beta-mannosidases. Nat Chem Biol 4:306-12 (2008)  
Target
Name:
Beta-mannosidase
Synonyms:
Type:
Protien
Mol. Mass.:
99501.54
Organism:
Bacteroides thetaiotaomicron
Description:
Q8AAK6
Residue:
864
  
Inhibitor
Name:
BDBM36389
Synonyms:
8-Aza-bicyclo[3.2.1]octane-1,2,3,4-tetraol, 14 | CID124434
Type:
Small organic molecule
Emp. Form.:
C7H13NO4
Mol. Mass.:
175.1824
SMILES:
O[C@H]1[C@H]2CC[C@](O)(N2)[C@@H](O)[C@@H]1O
: