Target
Protein Wnt-2
Ligand
BDBM36413
Substrate
Meas. Tech.
Wnt Inhibition Assay
pH
7.4±0
Temperature
277.15±0 K
IC50
40±0.0 nM
Citation
 Chen, BDodge, METang, WLu, JMa, ZFan, CWWei, SHao, WKilgore, JWilliams, NSRoth, MGAmatruda, JFChen, CLum, L Small molecule-mediated disruption of Wnt-dependent signaling in tissue regeneration and cancer. Nat Chem Biol 5:100-7 (2009)  
Target
Name:
Protein Wnt-2
Synonyms:
Irp WNT2_MOUSE Wnt2
Type:
Protein
Mol. Mass.:
40507.27
Organism:
Mus musculus (Mouse)
Description:
P21552
Residue:
360
  
Inhibitor
Name:
BDBM36413
Synonyms:
CID15995771 | trans-N-Benzyl-4-((1-((6-methyl-4-oxo-4H-pyrido[1,2-a]pyrimidin-2-yl)methyl)-2,4-dioxo-1,2-dihydroquinazolin-3(4H)-yl)methyl)cyclohexanecarboxamide, 3
Type:
Small organic molecule
Emp. Form.:
C33H33N5O4
Mol. Mass.:
563.6462
SMILES:
[H][C@]1(Cn2c(=O)n(Cc3cc(=O)n4c(C)cccc4n3)c3ccccc3c2=O)CC[C@@]([H])(CC1)C(=O)NCc1ccccc1
: