Target
Protein Wnt-2
Ligand
BDBM36414
Substrate
Meas. Tech.
Wnt Inhibition Assay
pH
7.4±0
Temperature
277.15±0 K
IC50
25±0.0 nM
Citation
 Chen, BDodge, METang, WLu, JMa, ZFan, CWWei, SHao, WKilgore, JWilliams, NSRoth, MGAmatruda, JFChen, CLum, L Small molecule-mediated disruption of Wnt-dependent signaling in tissue regeneration and cancer. Nat Chem Biol 5:100-7 (2009)  
Target
Name:
Protein Wnt-2
Synonyms:
Irp WNT2_MOUSE Wnt2
Type:
Protein
Mol. Mass.:
40507.27
Organism:
Mus musculus (Mouse)
Description:
P21552
Residue:
360
  
Inhibitor
Name:
BDBM36414
Synonyms:
CID15993586 | trans-N-Benzyl-4-((1-((2-cyanophenyl)methyl)-2,4-dioxo-1,2-dihydroquinazolin-3(4H)-yl)methyl)cyclohexanecarboxamide, 4
Type:
Small organic molecule
Emp. Form.:
C31H30N4O3
Mol. Mass.:
506.5949
SMILES:
[H][C@]1(Cn2c(=O)n(Cc3ccccc3C#N)c3ccccc3c2=O)CC[C@@]([H])(CC1)C(=O)NCc1ccccc1
: