Target
Phospholipase D1
Ligand
BDBM50258182
Substrate
Meas. Tech.
293-PLD2 Cell-Based Assay
Temperature
310.15±0 K
EC50
1800±0 nM
Citation
 Scott, SASelvy, PEBuck, JRCho, HPCriswell, TLThomas, ALArmstrong, MDArteaga, CLLindsley, CWBrown, HA Design of isoform-selective phospholipase D inhibitors that modulate cancer cell invasiveness. Nat Chem Biol 5:108-17 (2009)  
Target
Name:
Phospholipase D1
Synonyms:
Choline phosphatase 1 PLD1 Phosphatidylcholine-hydrolyzing phospholipase D1 Phospholipase D1 Phospholipase D2 (PLD2) | hPLD1
Type:
Protein
Mol. Mass.:
124219.92
Organism:
Homo sapiens (Human)
Description:
Q13393
Residue:
1074
  
Inhibitor
Name:
BDBM50258182
Synonyms:
(S)-N-(1-(4-(5-Chloro-2-oxo-2,3-dihydro-1H-benzo[d]imidazol-1-yl)piperidin-1-yl)propan-2-yl)-2-naphthamide, 69 (S)-N-(1-(4-(5-chloro-2-oxo-2,3-dihydro-1H-benzo[d]imidazol-1-yl)piperidin-1-yl)propan-2-yl)naphthalene-2-carboxamide | CHEMBL492572
Type:
Small organic molecule
Emp. Form.:
C26H27ClN4O2
Mol. Mass.:
462.971
SMILES:
C[C@@H](CN1CCC(CC1)n1c2ccc(Cl)cc2[nH]c1=O)NC(=O)c1ccc2ccccc2c1
: