Target
Histone deacetylase 7
Ligand
BDBM36483
Substrate
Meas. Tech.
HDAC Enzyme Activity Assay
pH
7.4±0
Temperature
273.15±n/a K
IC50
1293±n/a nM
Citation
 Bradner, JEWest, NGrachan, MLGreenberg, EFHaggarty, SJWarnow, TMazitschek, R Chemical phylogenetics of histone deacetylases. Nat Chem Biol 6:238-243 (2010)  
Target
Name:
Histone deacetylase 7
Synonyms:
HD7 HDAC7A Histone acetylase 7 (HDAC7) Human HDAC7
Type:
Chromatin regulator; hydrolase; repressor
Mol. Mass.:
102942.62
Organism:
Homo sapiens (Human)
Description:
Q8WUI4
Residue:
952
  
Inhibitor
Name:
BDBM36483
Synonyms:
(S)-6-acetamido-2-(2-((S)-2-acetamido-4-methylpentanamido)acetamido)-N-(4-methyl-2-oxo-2H-chromen-7-yl)hexanamide, 3 | CID10460379
Type:
Small organic molecule
Emp. Form.:
C28H39N5O7
Mol. Mass.:
557.6386
SMILES:
CC(C)C[C@H](NC(C)=O)C(=O)NCC(=O)N[C@@H](CCCCNC(C)=O)C(=O)Nc1ccc2c(C)cc(=O)oc2c1
: