Target
Prothrombin
Ligand
BDBM36574
Substrate
Meas. Tech.
Inhibition Assay
Ki
5e+2±n/a nM
Citation
 Obst, UBanner, DWWeber, LDiederich, F Molecular recognition at the thrombin active site: structure-based design and synthesis of potent and selective thrombin inhibitors and the X-ray crystal structures of two thrombin-inhibitor complexes. Chem Biol 4:287-95 (1997)  
Target
Name:
Prothrombin
Synonyms:
Activation peptide fragment 1 Coagulation factor II Prothrombin precursor Thrombin heavy chain | Thrombin light chain
Type:
Protein
Mol. Mass.:
70029.57
Organism:
Homo sapiens (Human)
Description:
P00734
Residue:
622
  
Inhibitor
Name:
BDBM36574
Synonyms:
Bicyclic core, rac-21
Type:
Small organic molecule
Emp. Form.:
C24H26N4O4
Mol. Mass.:
434.4876
SMILES:
CN1[C@H](C2C(C(=O)N(Cc3ccc4OCOc4c3)C2=O)C1(C)C)c1ccc(cc1)C(N)=N
: