Target
Serine protease 1
Ligand
BDBM36578
Substrate
Meas. Tech.
Inhibition Assay
Ki
6.7e+3±n/a nM
Citation
 Obst, UBanner, DWWeber, LDiederich, F Molecular recognition at the thrombin active site: structure-based design and synthesis of potent and selective thrombin inhibitors and the X-ray crystal structures of two thrombin-inhibitor complexes. Chem Biol 4:287-95 (1997)  
Target
Name:
Serine protease 1
Synonyms:
Alpha-trypsin chain 1 Beta-trypsin PRSS1 TRP1 TRY1_HUMAN Thrombin & trypsin Trypsin I | Trypsin-1
Type:
Enzyme
Mol. Mass.:
26557.80
Organism:
Homo sapiens (Human)
Description:
P07477
Residue:
247
  
Inhibitor
Name:
BDBM36578
Synonyms:
Bicyclic core, rac-13d
Type:
Small organic molecule
Emp. Form.:
C27H34N4O3
Mol. Mass.:
462.5839
SMILES:
CCC[C@@H]1C2C([C@@H](N(C)C2(C)C)c2ccc(cc2)C(N)=N)C(=O)N1Cc1ccc2OCOc2c1
: