Target
Serine protease 1
Ligand
BDBM36580
Substrate
Meas. Tech.
Inhibition Assay
Ki
6.4e+4±n/a nM
Citation
 Obst, UBanner, DWWeber, LDiederich, F Molecular recognition at the thrombin active site: structure-based design and synthesis of potent and selective thrombin inhibitors and the X-ray crystal structures of two thrombin-inhibitor complexes. Chem Biol 4:287-95 (1997)  
Target
Name:
Serine protease 1
Synonyms:
Alpha-trypsin chain 1 Beta-trypsin PRSS1 TRP1 TRY1_HUMAN Thrombin & trypsin Trypsin I | Trypsin-1
Type:
Enzyme
Mol. Mass.:
26557.80
Organism:
Homo sapiens (Human)
Description:
P07477
Residue:
247
  
Inhibitor
Name:
BDBM36580
Synonyms:
Bicyclic core, rac-9
Type:
Small organic molecule
Emp. Form.:
C24H28N4O3
Mol. Mass.:
420.5041
SMILES:
CN1[C@H](C2CN(Cc3ccc4OCOc4c3)C(=O)C2C1(C)C)c1ccc(cc1)C(N)=N
: