Target
Gag-Pol polyprotein [489-587]
Ligand
BDBM1135
Substrate
Meas. Tech.
Protease Inhibition Assay
Ki
185±n/a nM
Citation
 De Lucca, GVLiang, JDe Lucca, I Stereospecific synthesis, structure-activity relationship, and oral bioavailability of tetrahydropyrimidin-2-one HIV protease inhibitors. J Med Chem 42:135-52 (1999)  
Target
Name:
Gag-Pol polyprotein [489-587]
Synonyms:
Human immunodeficiency virus type 1 protease Pol polyprotein | gag-pol
Type:
Enzyme Subunit
Mol. Mass.:
10781.16
Organism:
Human immunodeficiency virus type 1
Description:
P04585[489-587]
Residue:
99
  
Inhibitor
Name:
BDBM1135
Synonyms:
(4R,5S,6S)-1,3,4-tribenzyl-6-(1-bromo-2-phenylethyl)-5-hydroxy-1,3-diazinan-2-one Tetrahydropyrimidinone deriv. 18a
Type:
Small Organic Molecule
Emp. Form.:
C33H33BrN2O2
Mol. Mass.:
569.531
SMILES:
O[C@H]1[C@@H](Cc2ccccc2)N(Cc2ccccc2)C(=O)N(Cc2ccccc2)[C@@H]1[C@@H](Br)Cc1ccccc1
: