Target
Tyrosine-protein kinase Fgr
Ligand
BDBM13216
Substrate
Meas. Tech.
Kinase Inhibitor Selectivity Profiling Assay
Kd
0.50±n/a nM
Citation
 PubChem, PC Kinase Inhibitor Selectivity Profiling Assay PubChem Bioassay (2008)[AID] 
Target
Name:
Tyrosine-protein kinase Fgr
Synonyms:
FGR Gardner-Rasheed feline sarcoma viral (v-fgr) oncogene homolog SRC p55-Fgr p58c-Fgr
Type:
protein
Mol. Mass.:
59469.88
Organism:
Homo sapiens (Human)
Description:
P09769
Residue:
529
  
Inhibitor
Name:
BDBM13216
Synonyms:
BMS-354825 DASATINIB N-(2-chloro-6-methylphenyl)-2-({6-[4-(2-hydroxyethyl)piperazin-1-yl]-2-methylpyrimidin-4-yl}amino)-1,3-thiazole-5-carboxamide US20230348453, Compound A8 med.21724, Compound Dasatinib
Type:
Small organic molecule
Emp. Form.:
C22H26ClN7O2S
Mol. Mass.:
488.006
SMILES:
Cc1nc(Nc2ncc(s2)C(=O)Nc2c(C)cccc2Cl)cc(n1)N1CCN(CCO)CC1
: