Target
Ephrin type-A receptor 8
Ligand
BDBM5446
Substrate
Meas. Tech.
Kinase Inhibitor Selectivity Profiling Assay
Kd
940±n/a nM
Citation
 PubChem, PC Kinase Inhibitor Selectivity Profiling Assay PubChem Bioassay (2008)[AID] 
Target
Name:
Ephrin type-A receptor 8
Synonyms:
EEK EPHA8_HUMAN Ephrin type-A receptor 8 KIAA1459
Type:
PROTEIN
Mol. Mass.:
111022.09
Organism:
Homo sapiens (Human)
Description:
ChEMBL_774600
Residue:
1005
  
Inhibitor
Name:
BDBM5446
Synonyms:
CHEMBL553 Erlotinib N-(3-Ethynylphenyl)-6,7-bis(2-methoxyethoxy)-4-quinazolinamine Monohydrochloride OSI-774 US10189853, erlotinib US11524945, Compound Erlotinib US9730934, Erlotinib cid_176870
Type:
Small organic molecule
Emp. Form.:
C22H23N3O4
Mol. Mass.:
393.4357
SMILES:
COCCOc1cc2ncnc(Nc3cccc(c3)C#C)c2cc1OCCOC
: