Target
Sphingosine 1-phosphate receptor 1
Ligand
BDBM36905
Substrate
Meas. Tech.
Dose Response Assays for S1P1 Agonists and Agonism Potentiators - Potentiator Assay 60K MLSMR
EC50
12030±n/a nM
Citation
 PubChem, PC Dose Response Assays for S1P1 Agonists and Agonism Potentiators - Potentiator Assay 60K MLSMR PubChem Bioassay (2007)[AID] 
Target
Name:
Sphingosine 1-phosphate receptor 1
Synonyms:
CHEDG1 Endothelial differentiation G-protein coupled receptor 1 S1P1 S1PR1_HUMAN Sphingosine 1-phosphate receptor Edg-1
Type:
Enzyme
Mol. Mass.:
42836.02
Organism:
Homo sapiens (Human)
Description:
P21453
Residue:
382
  
Inhibitor
Name:
BDBM36905
Synonyms:
4-amino-6-methyl-2-(trifluoromethyl)-3-quinolinecarbonitrile 4-azanyl-6-methyl-2-(trifluoromethyl)quinoline-3-carbonitrile SMR000036800 | cid_660762
Type:
Small organic molecule
Emp. Form.:
C12H8F3N3
Mol. Mass.:
251.2072
SMILES:
Cc1ccc2nc(c(C#N)c(N)c2c1)C(F)(F)F
: