Target
Genome polyprotein
Ligand
BDBM403616
Substrate
Meas. Tech.
Ki Determination for Genotypes 1b and 3a NS3 Protease
Ki
0.050±n/a nM
Citation
 Bjornson, KCanales, ECottell, JJKarki, KKKatana, AAKato, DKobayashi, TLink, JOMartinez, RPhillips, BWPyun, HSangi, MSchrier, AJSiegel, DTaylor, JGTran, CVTrejo Martin, TAVivian, RWYang, ZZablocki, JZipfel, S Inhibitors of hepatitis C virus US Patent  US10335409 Publication Date 7/2/2019 
Target
Name:
Genome polyprotein
Synonyms:
HCV Polymerase (S282T) NS3/4A Protein POLG_HCVJA
Type:
Protein
Mol. Mass.:
327076.78
Organism:
Hepatitis C Virus (Virus)
Description:
P26662
Residue:
3010
  
Inhibitor
Name:
BDBM403616
Synonyms:
(1R,4S,4aR,8S,11S,12S,13R,25aR)-8-tert-butyl-N-[(1R,2R)-1-[(cyclopropylsulfonyl)carbamoyl]-2-(difluoromethyl)cyclopropyl]-17-methoxy-12-methyl-6,9-dioxo-2,3,4,4a,6,7,8,9,12,13,21,22,23,24,25,25a-hexadecahydro-1H,11H-1,4:10,13-dimethanoquinoxalino[2,3-k][1,10,3,6]benzodioxadiazacyclononadecine-11-carboxamide | US10335409, Example 26
Type:
Small organic molecule
Emp. Form.:
C37H50N4O7
Mol. Mass.:
662.8155
SMILES:
COC(=O)[C@@H]1[C@H](C)[C@H](CN1C(=O)[C@@H](NC(=O)O[C@H]1[C@@H]2CC[C@@H](C2)[C@@H]1CCCC=C)C(C)(C)C)Oc1nc2cc(OC)ccc2nc1C=C
: