Target
Sphingosine 1-phosphate receptor 1
Ligand
BDBM37138
Substrate
Meas. Tech.
Dose Response Assays for S1P1 Agonists and Agonism Potentiators - Parental Cell Line Counter Screen 60K MLSMR
EC50
>95100±n/a nM
Citation
 PubChem, PC Dose Response Assays for S1P1 Agonists and Agonism Potentiators - Parental Cell Line Counter Screen 60K MLSMR PubChem Bioassay (2007)[AID] 
Target
Name:
Sphingosine 1-phosphate receptor 1
Synonyms:
CHEDG1 Endothelial differentiation G-protein coupled receptor 1 S1P1 S1PR1_HUMAN Sphingosine 1-phosphate receptor Edg-1
Type:
Enzyme
Mol. Mass.:
42836.02
Organism:
Homo sapiens (Human)
Description:
P21453
Residue:
382
  
Inhibitor
Name:
BDBM37138
Synonyms:
6-(4-methyl-1-piperazinyl)-2-(8-methyl-5-quinolinyl)-1H-benzo[de]isoquinoline-1,3(2H)-dione 6-(4-methylpiperazin-1-yl)-2-(8-methylquinolin-5-yl)benzo[de]isoquinoline-1,3-dione MLS000089012 cid_2193273
Type:
Small organic molecule
Emp. Form.:
C27H24N4O2
Mol. Mass.:
436.5051
SMILES:
CN1CCN(CC1)c1ccc2C(=O)N(C(=O)c3cccc1c23)c1ccc(C)c2ncccc12
: