Target
Sphingosine 1-phosphate receptor 3
Ligand
BDBM37361
Substrate
Meas. Tech.
Dose Response Assay for S1P3 Antagonists
IC50
17380±n/a nM
Citation
 PubChem, PC Dose Response Assay for S1P3 Antagonists PubChem Bioassay (2007)[AID] 
Target
Name:
Sphingosine 1-phosphate receptor 3
Synonyms:
C9orf108 EDG3 S1P receptor 3 S1P3 S1PR3_HUMAN Sphingosine 1-phosphate receptor 3 (S1P3) | Sphingosine 1-phosphate receptor Edg-3
Type:
G Protein-Coupled Receptor (GPCR)
Mol. Mass.:
42278.13
Organism:
Homo sapiens (Human)
Description:
Q99500
Residue:
378
  
Inhibitor
Name:
BDBM37361
Synonyms:
8-[2-(4-Methoxy-phenyl)-5-phenyl-pyrazolo[1,5-a]pyrimidin-7-yl]-1,4-dioxa-8-aza-spiro[4.5]decane 8-[2-(4-methoxyphenyl)-5-phenyl-pyrazolo[1,5-a]pyrimidin-7-yl]-1,4-dioxa-8-azaspiro[4.5]decane MLS000035341 cid_650554
Type:
Small organic molecule
Emp. Form.:
C26H26N4O3
Mol. Mass.:
442.5096
SMILES:
COc1ccc(cc1)-c1cc2nc(cc(N3CCC4(CC3)OCCO4)n2n1)-c1ccccc1
: