Target
fMet-Leu-Phe receptor
Ligand
BDBM37832
Substrate
Meas. Tech.
Dose Response Assay for Formylpeptide Receptor (FPR) Ligands and Dose Response Counter-Screen Assay for Formylpeptide-Like-1 (FPRL1) Ligands
Ki
>43700±n/a nM
Citation
 PubChem, PC Dose Response Assay for Formylpeptide Receptor (FPR) Ligands and Dose Response Counter-Screen Assay for Formylpeptide-Like-1 (FPRL1) Ligands PubChem Bioassay (2007)[AID] 
Target
Name:
fMet-Leu-Phe receptor
Synonyms:
FPR FPR1_HUMAN N-formyl peptide receptor 1 fMLP receptor formyl peptide receptor 1
Type:
Enzyme Catalytic Domain
Mol. Mass.:
38456.14
Organism:
Homo sapiens (Human)
Description:
gi_4503779
Residue:
350
  
Inhibitor
Name:
BDBM37832
Synonyms:
1-(4-anilinophenyl)-3-propyl-thiourea 1-(4-phenylazanylphenyl)-3-propyl-thiourea N-(4-anilinophenyl)-N'-propylthiourea cid_2196077
Type:
Small organic molecule
Emp. Form.:
C16H19N3S
Mol. Mass.:
285.407
SMILES:
CCCNC(=S)Nc1ccc(Nc2ccccc2)cc1
: