Target
fMet-Leu-Phe receptor
Ligand
BDBM37619
Substrate
Meas. Tech.
Dose Response Assay for Formylpeptide Receptor (FPR) Ligands and Dose Response Counter-Screen Assay for Formylpeptide-Like-1 (FPRL1) Ligands
IC50
13500±n/a nM
Citation
 PubChem, PC Dose Response Assay for Formylpeptide Receptor (FPR) Ligands and Dose Response Counter-Screen Assay for Formylpeptide-Like-1 (FPRL1) Ligands PubChem Bioassay (2007)[AID] 
Target
Name:
fMet-Leu-Phe receptor
Synonyms:
FPR FPR1_HUMAN N-formyl peptide receptor 1 fMLP receptor formyl peptide receptor 1
Type:
Enzyme Catalytic Domain
Mol. Mass.:
38456.14
Organism:
Homo sapiens (Human)
Description:
gi_4503779
Residue:
350
  
Inhibitor
Name:
BDBM37619
Synonyms:
(4Z)-4-[(3-ethoxyphenyl)-hydroxymethylidene]-1-(2-methoxyethyl)-5-(5-methyl-2-furanyl)pyrrolidine-2,3-dione (4Z)-4-[(3-ethoxyphenyl)-oxidanyl-methylidene]-1-(2-methoxyethyl)-5-(5-methylfuran-2-yl)pyrrolidine-2,3-dione 4-(3-Ethoxy-benzoyl)-3-hydroxy-1-(2-methoxy-ethyl)-5-(5-methyl-furan-2-yl)-1,5-dihydro-pyrrol-2-one SMR000013587 | cid_6398928
Type:
Small organic molecule
Emp. Form.:
C21H23NO6
Mol. Mass.:
385.4104
SMILES:
CCOc1cccc(c1)C(=O)C1C(N(CCOC)C(=O)C1=O)c1ccc(C)o1
: