Target
Antithrombin-III/Prothrombin
Ligand
BDBM264648
Substrate
Meas. Tech.
Fluorometric ATIII/alphaIIa IC50 Plate Assay at pH 7.8
Temperature
298.15±n/a K
IC50
1670000±n/a nM
Comments
extracted
Citation
 Lawrence, DAEmal, CReinke, ALi, SWarnock, MAbernathy, G Plasminogen activator inhibitor-1 inhibitors and methods of use thereof US Patent  US9718760 Publication Date 8/1/2017 
Target
Name:
Antithrombin-III/Prothrombin
Synonyms:
ATIII/alphaIIa
Type:
Enzyme
Mol. Mass.:
Description:
Components:
This complex has 2 components.
Component 1
Name:
Antithrombin-III
Synonyms:
ANT3_HUMAN ATIII Antithrombin-III precursor SERPINC1
Type:
PROTEIN
Mol. Mass.:
52602.34
Organism:
Homo sapiens (Human)
Description:
ChEMBL_35871
Residue:
464
  
Component 2
Name:
Prothrombin
Synonyms:
Activation peptide fragment 1 Coagulation factor II Prothrombin precursor Thrombin heavy chain | Thrombin light chain
Type:
Protein
Mol. Mass.:
70029.57
Organism:
Homo sapiens (Human)
Description:
P00734
Residue:
622
  
Inhibitor
Name:
BDBM264648
Synonyms:
US9718760, C161
Type:
Small organic molecule
Emp. Form.:
C15H23NO4
Mol. Mass.:
281.3474
SMILES:
CCCCCCCCNC(=O)c1cc(O)c(O)c(O)c1
: