Target
N-formyl peptide receptor 2
Ligand
BDBM37831
Substrate
Meas. Tech.
Dose Response Assay for Formylpeptide Receptor-Like-1 (FPRL1) Ligands and Dose Response Counter-Screen Assay for Formylpeptide Receptor (FPR) Ligands
Ki
>40300±n/a nM
Comments
Extracted from aid = 520 and tid = 2
Citation
 PubChem, PC Dose Response Assay for Formylpeptide Receptor-Like-1 (FPRL1) Ligands and Dose Response Counter-Screen Assay for Formylpeptide Receptor (FPR) Ligands PubChem Bioassay (2007)[AID] 
Target
Name:
N-formyl peptide receptor 2
Synonyms:
ALXR, FPRL1, FPR2 FPR2 FPRH1 Formyl Peptide Receptor-Like 1 LXA4 receptor Lipoxin A4 receptor RFP | hFPRL
Type:
G Protein-Coupled Receptor (GPCR)
Mol. Mass.:
38968.35
Organism:
Homo sapiens (Human)
Description:
P25090
Residue:
351
  
Inhibitor
Name:
BDBM37831
Synonyms:
2-[(2-chloroanilino)-oxomethyl]-1-cyclohexanecarboxylic acid 2-[(2-chlorophenyl)carbamoyl]cyclohexanecarboxylic acid MLS000530275 cid_2838863
Type:
Small organic molecule
Emp. Form.:
C14H16ClNO3
Mol. Mass.:
281.735
SMILES:
OC(=O)C1CCCCC1C(=O)Nc1ccccc1Cl
: