Target
N-formyl peptide receptor 2
Ligand
BDBM37832
Substrate
Meas. Tech.
Dose Response Assay for Formylpeptide Receptor-Like-1 (FPRL1) Ligands and Dose Response Counter-Screen Assay for Formylpeptide Receptor (FPR) Ligands
IC50
>66700±n/a nM
Comments
Extracted from aid = 520 and tid = 3
Citation
 PubChem, PC Dose Response Assay for Formylpeptide Receptor-Like-1 (FPRL1) Ligands and Dose Response Counter-Screen Assay for Formylpeptide Receptor (FPR) Ligands PubChem Bioassay (2007)[AID] 
Target
Name:
N-formyl peptide receptor 2
Synonyms:
ALXR, FPRL1, FPR2 FPR2 FPRH1 Formyl Peptide Receptor-Like 1 LXA4 receptor Lipoxin A4 receptor RFP | hFPRL
Type:
G Protein-Coupled Receptor (GPCR)
Mol. Mass.:
38968.35
Organism:
Homo sapiens (Human)
Description:
P25090
Residue:
351
  
Inhibitor
Name:
BDBM37832
Synonyms:
1-(4-anilinophenyl)-3-propyl-thiourea 1-(4-phenylazanylphenyl)-3-propyl-thiourea N-(4-anilinophenyl)-N'-propylthiourea cid_2196077
Type:
Small organic molecule
Emp. Form.:
C16H19N3S
Mol. Mass.:
285.407
SMILES:
CCCNC(=S)Nc1ccc(Nc2ccccc2)cc1
: