Target
Dual specificity protein phosphatase 1
Ligand
BDBM34163
Substrate
Meas. Tech.
In vitro MKP-1 Phosphatase Dose Response Active/Probe Assessment Assay - Reproducibility testing
IC50
7340±n/a nM
Citation
 PubChem, PC In vitro MKP-1 Phosphatase Dose Response Active/Probe Assessment Assay - Reproducibility testing PubChem Bioassay (2006)[AID] 
Target
Name:
Dual specificity protein phosphatase 1
Synonyms:
CL100 DUSP1 MAP kinase phosphatase 1 MKP1 Protein-tyrosine phosphatase CL100 | VH1
Type:
Protein phosphatase
Mol. Mass.:
39301.48
Organism:
Homo sapiens (Human)
Description:
gi_4758204
Residue:
367
  
Inhibitor
Name:
BDBM34163
Synonyms:
3-Amino-7-benzyl-1-thioxo-5,6,7,8-tetrahydro-1H-thiopyrano[3,4-c]pyridine-4-carbonitrile 3-amino-7-benzyl-1-sulfanylidene-6,8-dihydro-5H-thiopyrano[3,4-c]pyridine-4-carbonitrile 3-azanyl-7-(phenylmethyl)-1-sulfanylidene-6,8-dihydro-5H-thiopyrano[3,4-c]pyridine-4-carbonitrile SMR000011772 | cid_787437
Type:
Small organic molecule
Emp. Form.:
C16H15N3S2
Mol. Mass.:
313.44
SMILES:
Nc1sc(=S)c2CN(Cc3ccccc3)CCc2c1C#N
: