Target
Steroidogenic factor 1
Ligand
BDBM38962
Substrate
Meas. Tech.
Dose-response cell-based assay for inhibitors of the nuclear receptor Steroidogenic Factor 1 (SF-1)
IC50
315±n/a nM
Citation
 PubChem, PC Dose-response cell-based assay for inhibitors of the nuclear receptor Steroidogenic Factor 1 (SF-1) PubChem Bioassay (2007)[AID] 
Target
Name:
Steroidogenic factor 1
Synonyms:
AD4BP FTZF1 NR5A1 SF-1 STF-1 Steroid hormone receptor Ad4BP
Type:
Nuclear Hormone Receptor
Mol. Mass.:
51643.43
Organism:
Homo sapiens (Human)
Description:
Residue:
461
  
Inhibitor
Name:
BDBM38962
Synonyms:
6-[4-(3-chlorophenyl)-1-piperazinyl]-3-cyclohexyl-1H-pyrimidine-2,4-dione 6-[4-(3-chlorophenyl)piperazin-1-yl]-3-cyclohexylpyrimidine-2,4(1H,3H)-dione MLS000094380 cid_3238389
Type:
Small organic molecule
Emp. Form.:
C20H25ClN4O2
Mol. Mass.:
388.891
SMILES:
Clc1cccc(c1)N1CCN(CC1)c1cc(=O)n(C2CCCCC2)c(=O)[nH]1
: