Target
Isoform 2 of Nuclear receptor ROR-alpha (Alpha-2)
Ligand
BDBM38962
Substrate
Meas. Tech.
Dose-response cell-based assay for inhibitors of the Retinoic Acid Receptor-related orphan receptor A (RORA)
IC50
675±n/a nM
Citation
 PubChem, PC Dose-response cell-based assay for inhibitors of the Retinoic Acid Receptor-related orphan receptor A (RORA) PubChem Bioassay (2007)[AID] 
Target
Name:
Isoform 2 of Nuclear receptor ROR-alpha (Alpha-2)
Synonyms:
NR1F1 Nuclear receptor ROR-alpha (Alpha-2) RORA RZRA
Type:
PROTEIN
Mol. Mass.:
63033.59
Organism:
Homo sapiens (Human)
Description:
EBI_101591
Residue:
556
  
Inhibitor
Name:
BDBM38962
Synonyms:
6-[4-(3-chlorophenyl)-1-piperazinyl]-3-cyclohexyl-1H-pyrimidine-2,4-dione 6-[4-(3-chlorophenyl)piperazin-1-yl]-3-cyclohexylpyrimidine-2,4(1H,3H)-dione MLS000094380 cid_3238389
Type:
Small organic molecule
Emp. Form.:
C20H25ClN4O2
Mol. Mass.:
388.891
SMILES:
Clc1cccc(c1)N1CCN(CC1)c1cc(=O)n(C2CCCCC2)c(=O)[nH]1
: