Target
Rho-associated protein kinase 2
Ligand
BDBM39216
Substrate
Meas. Tech.
Dose-response biochemical assay of inhibitors of Rho kinase 2 (Rock2)
IC50
>59640±n/a nM
Citation
 PubChem, PC Dose-response biochemical assay of inhibitors of Rho kinase 2 (Rock2)  PubChem Bioassay (2007)[AID] 
Target
Name:
Rho-associated protein kinase 2
Synonyms:
KIAA0619 ROCK2 Rho kinase 2 (ROCKII) Rho-associated protein kinase 2 (ROCK2) Rho-associated protein kinase 2/Transforming protein RhoA Rho-associated, coiled-coil-containing protein kinase II p164 ROCK-2
Type:
Protein
Mol. Mass.:
160885.43
Organism:
Homo sapiens (Human)
Description:
O75116
Residue:
1388
  
Inhibitor
Name:
BDBM39216
Synonyms:
3-methyl-N-(2-pyridin-4-yl-1,3-benzoxazol-5-yl)butanamide MLS000039067 cid_659689
Type:
Small organic molecule
Emp. Form.:
C17H17N3O2
Mol. Mass.:
295.3358
SMILES:
CC(C)CC(=O)Nc1ccc2oc(nc2c1)-c1ccncc1
: