Target
Dual specificity protein phosphatase 1
Ligand
BDBM32098
Substrate
Meas. Tech.
Cdc25B Catalytic Domain Protein Tyrosine Phosphatase Probe Assessment: MKP-1 Dose Response Selectivity comparison.
IC50
8746±n/a nM
Citation
 PubChem, PC Cdc25B Catalytic Domain Protein Tyrosine Phosphatase Probe Assessment: MKP-1 Dose Response Selectivity comparison. PubChem Bioassay (2007)[AID] 
Target
Name:
Dual specificity protein phosphatase 1
Synonyms:
CL100 DUSP1 MAP kinase phosphatase 1 MKP1 Protein-tyrosine phosphatase CL100 | VH1
Type:
Protein phosphatase
Mol. Mass.:
39301.48
Organism:
Homo sapiens (Human)
Description:
gi_4758204
Residue:
367
  
Inhibitor
Name:
BDBM32098
Synonyms:
3-(2-methylanilino)-2H-isoquinolin-1-one 3-[(2-methylphenyl)amino]-2H-isoquinolin-1-one MLS000043700 cid_2142222
Type:
Small organic molecule
Emp. Form.:
C16H14N2O
Mol. Mass.:
250.2952
SMILES:
Cc1ccccc1Nc1cc2ccccc2c(=O)[nH]1
: