Target
Alkaline phosphatase, germ cell type
Ligand
BDBM39628
Substrate
Meas. Tech.
Luminescent assay for HTS discovery of chemical inhibitors of placental alkaline phosphatase
IC50
4100±270 nM
Citation
 PubChem, PC Luminescent assay for HTS discovery of chemical inhibitors of placental alkaline phosphatase PubChem Bioassay (2007)[AID] 
Target
Name:
Alkaline phosphatase, germ cell type
Synonyms:
ALPG ALPPL2 PPBN_HUMAN | placental-like alkaline phosphatase preproprotein
Type:
PROTEIN
Mol. Mass.:
57374.31
Organism:
Homo sapiens (Human)
Description:
ChEMBL_29964
Residue:
532
  
Inhibitor
Name:
BDBM39628
Synonyms:
(E)-2-(benzenesulfonyl)-3-(3,4-dihydroxyphenyl)-2-propenenitrile (E)-2-besyl-3-(3,4-dihydroxyphenyl)acrylonitrile 3-(3,4-dihydroxyphenyl)-2-(phenylsulfonyl)acrylonitrile SMR000076437 | cid_978069
Type:
Small organic molecule
Emp. Form.:
C15H11NO4S
Mol. Mass.:
301.317
SMILES:
Oc1ccc(\C=C(/C#N)S(=O)(=O)c2ccccc2)cc1O
: