Target
Alkaline phosphatase, germ cell type
Ligand
BDBM39716
Substrate
Meas. Tech.
Luminescent assay for HTS discovery of chemical inhibitors of placental alkaline phosphatase
IC50
4970±600 nM
Citation
 PubChem, PC Luminescent assay for HTS discovery of chemical inhibitors of placental alkaline phosphatase PubChem Bioassay (2007)[AID] 
Target
Name:
Alkaline phosphatase, germ cell type
Synonyms:
ALPG ALPPL2 PPBN_HUMAN | placental-like alkaline phosphatase preproprotein
Type:
PROTEIN
Mol. Mass.:
57374.31
Organism:
Homo sapiens (Human)
Description:
ChEMBL_29964
Residue:
532
  
Inhibitor
Name:
BDBM39716
Synonyms:
(4Z)-4-[[[4-(2-furanyl)-2-propan-2-ylimino-3-thiazolyl]amino]methylidene]-2-hydroxy-1-cyclohexa-2,5-dienone (4Z)-4-[[[4-(furan-2-yl)-2-propan-2-ylimino-1,3-thiazol-3-yl]amino]methylidene]-2-hydroxycyclohexa-2,5-dien-1-one MLS000565216 cid_9551943
Type:
Small organic molecule
Emp. Form.:
C17H17N3O3S
Mol. Mass.:
343.4
SMILES:
CC(C)N=c1scc(-c2ccco2)n1N=Cc1ccc(O)c(O)c1
: