Target
Alkaline phosphatase, germ cell type
Ligand
BDBM39802
Substrate
Meas. Tech.
Luminescent assay for HTS discovery of chemical inhibitors of placental alkaline phosphatase
IC50
7340±800 nM
Citation
 PubChem, PC Luminescent assay for HTS discovery of chemical inhibitors of placental alkaline phosphatase PubChem Bioassay (2007)[AID] 
Target
Name:
Alkaline phosphatase, germ cell type
Synonyms:
ALPG ALPPL2 PPBN_HUMAN | placental-like alkaline phosphatase preproprotein
Type:
PROTEIN
Mol. Mass.:
57374.31
Organism:
Homo sapiens (Human)
Description:
ChEMBL_29964
Residue:
532
  
Inhibitor
Name:
BDBM39802
Synonyms:
MLS000577776 N-[(3,5-dimethyl-1-phenyl-4-pyrazolyl)methylideneamino]-3-phenyl-1H-pyrazole-5-carboxamide N-[(3,5-dimethyl-1-phenyl-pyrazol-4-yl)methylideneamino]-3-phenyl-1H-pyrazole-5-carboxamide SMR000187161 | cid_2868592
Type:
Small organic molecule
Emp. Form.:
C22H20N6O
Mol. Mass.:
384.4338
SMILES:
Cc1nn(c(C)c1C=NNC(=O)c1cc(n[nH]1)-c1ccccc1)-c1ccccc1
: