Target
Gag-Pol polyprotein [588-1027]/[588-1147]
Ligand
BDBM1738
Substrate
RNA:DNA template:primer
Meas. Tech.
HIV-1 RT Assay
pH
8±n/a
IC50
7200±n/a nM
Comments
HIV-1 RT inhibitor 2-nitrophenyl phenyl sulfone (NPPS) shows IC50 value of 16,000 nM in the same enzyme assay.
Citation
 Chan, JHHong, JSHunter, RNOrr, GFCowan, JRSherman, DBSparks, SMReitter, BEAndrews, CWHazen, RJSt Clair, MBoone, LRFerris, RGCreech, KLRoberts, GBShort, SAWeaver, KOtt, RJRen, JHopkins, AStuart, DIStammers, DK 2-Amino-6-arylsulfonylbenzonitriles as non-nucleoside reverse transcriptase inhibitors of HIV-1. J Med Chem 44:1866-82 (2001)  
Target
Name:
Gag-Pol polyprotein [588-1027]/[588-1147]
Synonyms:
EC: 2.7.7.49 | HIV-1 Reverse Transcriptase
Type:
Protein Complex
Mol. Mass.:
115684
Description:
Components:
This complex has 2 components.
Component 1
Name:
Gag-Pol polyprotein [588-1147]
Synonyms:
HIV-1 Reverse Transcriptase Chain A gag-pol
Type:
Enzyme Subunit
Mol. Mass.:
64486.41
Organism:
Human immunodeficiency virus type 1
Description:
P04585[588-1147]
Residue:
560
  
Component 2
Name:
Gag-Pol polyprotein [588-1027]
Synonyms:
HIV-1 Reverse Transcriptase Chain B gag-pol
Type:
Enzyme Subunit
Mol. Mass.:
51337.13
Organism:
Human immunodeficiency virus type 1
Description:
P04585[588-1027]
Residue:
440
  
Inhibitor
Name:
BDBM1738
Synonyms:
2-Amino-6-arylthiobenzonitrile deriv. 1h | 2-amino-6-[(2-chlorophenyl)sulfanyl]benzonitrile
Type:
Small organic molecule
Emp. Form.:
C13H9ClN2S
Mol. Mass.:
260.742
SMILES:
Nc1cccc(Sc2ccccc2Cl)c1C#N
:
Substrate
Name:
RNA:DNA template:primer
Synonyms:
Type:
RNA-DNA duplex
Mol. Mass.:
358.43
Organism:
Description:
The incorporation of Cy5-dUTP onto a Europium(Eu) labeled primer:template.
Residue:
3
NA