Target
Gag-Pol polyprotein [588-1027]/[588-1147]
Ligand
BDBM1769
Substrate
RNA:DNA template:primer
Meas. Tech.
HIV-1 RT Assay
IC50
500±n/a nM
Citation
 Chan, JHHong, JSHunter, RNOrr, GFCowan, JRSherman, DBSparks, SMReitter, BEAndrews, CWHazen, RJSt Clair, MBoone, LRFerris, RGCreech, KLRoberts, GBShort, SAWeaver, KOtt, RJRen, JHopkins, AStuart, DIStammers, DK 2-Amino-6-arylsulfonylbenzonitriles as non-nucleoside reverse transcriptase inhibitors of HIV-1. J Med Chem 44:1866-82 (2001)  
Target
Name:
Gag-Pol polyprotein [588-1027]/[588-1147]
Synonyms:
EC: 2.7.7.49 | HIV-1 Reverse Transcriptase
Type:
Protein Complex
Mol. Mass.:
115684
Description:
Components:
This complex has 2 components.
Component 1
Name:
Gag-Pol polyprotein [588-1147]
Synonyms:
HIV-1 Reverse Transcriptase Chain A gag-pol
Type:
Enzyme Subunit
Mol. Mass.:
64486.41
Organism:
Human immunodeficiency virus type 1
Description:
P04585[588-1147]
Residue:
560
  
Component 2
Name:
Gag-Pol polyprotein [588-1027]
Synonyms:
HIV-1 Reverse Transcriptase Chain B gag-pol
Type:
Enzyme Subunit
Mol. Mass.:
51337.13
Organism:
Human immunodeficiency virus type 1
Description:
P04585[588-1027]
Residue:
440
  
Inhibitor
Name:
BDBM1769
Synonyms:
2-Amino-6-arylthiobenzonitrile deriv. 2n CHEMBL54318
Type:
Small organic molecule
Emp. Form.:
C15H14N2OS
Mol. Mass.:
270.349
SMILES:
Cc1cc(C)cc(c1)S(=O)c1cccc(N)c1C#N
:
Substrate
Name:
RNA:DNA template:primer
Synonyms:
Type:
RNA-DNA duplex
Mol. Mass.:
358.43
Organism:
Description:
The incorporation of Cy5-dUTP onto a Europium(Eu) labeled primer:template.
Residue:
3
NA