Target
Estrogen receptor
Ligand
BDBM39947
Substrate
Meas. Tech.
Estrogen Receptor-alpha Coactivator Binding Inhibitors Dose Response Confirmation
IC50
42693.84±n/a nM
Citation
 PubChem, PC Estrogen Receptor-alpha Coactivator Binding Inhibitors Dose Response Confirmation PubChem Bioassay (2007)[AID] 
Target
Name:
Estrogen receptor
Synonyms:
ER ESR ESR1_HUMAN Estrogen receptor Estrogen receptor (ER-alpha) Estrogen receptor alpha (ER) Nuclear receptor subfamily 3 group A member 1
Type:
Protein
Mol. Mass.:
66230.44
Organism:
Homo sapiens (Human)
Description:
P03372
Residue:
595
  
Inhibitor
Name:
BDBM39947
Synonyms:
MLS000098633 N-[[5-[2-[(4-ethyl-5-thiophen-2-yl-1,2,4-triazol-3-yl)sulfanyl]ethanoyl]furan-2-yl]methyl]ethanamide N-[[5-[2-[[4-ethyl-5-(2-thienyl)-1,2,4-triazol-3-yl]thio]acetyl]-2-furyl]methyl]acetamide cid_2570212
Type:
Small organic molecule
Emp. Form.:
C17H18N4O3S2
Mol. Mass.:
390.48
SMILES:
CCn1c(SCC(=O)c2ccc(CNC(C)=O)o2)nnc1-c1cccs1
: