Target
Estrogen receptor
Ligand
BDBM40025
Substrate
Meas. Tech.
Estrogen Receptor-alpha Coactivator Binding Inhibitors Dose Response Confirmation
IC50
31657.96±n/a nM
Citation
 PubChem, PC Estrogen Receptor-alpha Coactivator Binding Inhibitors Dose Response Confirmation PubChem Bioassay (2007)[AID] 
Target
Name:
Estrogen receptor
Synonyms:
ER ESR ESR1_HUMAN Estrogen receptor Estrogen receptor (ER-alpha) Estrogen receptor alpha (ER) Nuclear receptor subfamily 3 group A member 1
Type:
Protein
Mol. Mass.:
66230.44
Organism:
Homo sapiens (Human)
Description:
P03372
Residue:
595
  
Inhibitor
Name:
BDBM40025
Synonyms:
2-methoxy-4-[(Z)-(6-oxo-2-pyridin-4-yl[1,3]thiazolo[3,2-b][1,2,4]triazol-5(6H)-ylidene)methyl]phenyl acetate SMR000019843 [2-methoxy-4-[(6-oxo-2-pyridin-4-yl-[1,3]thiazolo[3,2-b][1,2,4]triazol-5-ylidene)methyl]phenyl] acetate acetic acid [4-[[6-keto-2-(4-pyridyl)thiazolo[3,2-b][1,2,4]triazol-5-ylidene]methyl]-2-methoxy-phenyl] ester | cid_3239822
Type:
Small organic molecule
Emp. Form.:
C19H14N4O4S
Mol. Mass.:
394.404
SMILES:
COc1cc(C=c2sc3nc(nn3c2=O)-c2ccncc2)ccc1OC(C)=O
: