Target
N-formyl peptide receptor 2
Ligand
BDBM40407
Substrate
Meas. Tech.
Formylpeptide Receptor (FPR) Ligand Structure Activity Relationship (SAR) Analysis : Dose Response Assay Counterscreen Against Formyl Peptide Receptor-Like-1 (FPRL1)
Ki
>40300±n/a nM
Citation
 PubChem, PC Formylpeptide Receptor (FPR) Ligand Structure Activity Relationship (SAR) Analysis : Dose Response Assay Counterscreen Against Formyl Peptide Receptor-Like-1 (FPRL1)  PubChem Bioassay (2007)[AID] 
Target
Name:
N-formyl peptide receptor 2
Synonyms:
ALXR, FPRL1, FPR2 FPR2 FPRH1 Formyl Peptide Receptor-Like 1 LXA4 receptor Lipoxin A4 receptor RFP | hFPRL
Type:
G Protein-Coupled Receptor (GPCR)
Mol. Mass.:
38968.35
Organism:
Homo sapiens (Human)
Description:
P25090
Residue:
351
  
Inhibitor
Name:
BDBM40407
Synonyms:
(4E)-1-(2-methoxyethyl)-4-[oxidanyl(phenyl)methylidene]-5-(4-propan-2-ylphenyl)pyrrolidine-2,3-dione (4E)-4-[hydroxy(phenyl)methylidene]-1-(2-methoxyethyl)-5-(4-propan-2-ylphenyl)pyrrolidine-2,3-dione cid_5345552
Type:
Small organic molecule
Emp. Form.:
C23H25NO4
Mol. Mass.:
379.4489
SMILES:
COCCN1C(C(C(=O)c2ccccc2)C(=O)C1=O)c1ccc(cc1)C(C)C
: